BDBM50372560 CHEMBL428072
SMILES COc1ccc(CC(=O)Nc2cc(nc(n2)-c2ccc(C)o2)-n2nc(C)cc2C)cc1
InChI Key InChIKey=SFYBQIGNEKPAAC-UHFFFAOYSA-N
Data  1 KI
  Tab Delimited (TSV)   2D SDfile   Computed 3D by Vconf -m prep SDfile
Find this compound or compounds like it in BindingDB:
Activity Spreadsheet -- Enzyme Inhibition Constant Data from BindingDB
Found 1 hit for monomerid = 50372560
TargetAdenosine receptor A2a(Homo sapiens (Human))
Neurocrine Biosciences
Curated by ChEMBL
LigandPNGBDBM50372560(CHEMBL428072)
Affinity DataKi:  4nM. Assay description: Displacement of [3H]ZM241385 from human adenosine A2A receptor expressed in HEK293 cells
In DepthDetails ArticlePubMed